{"text_format":"1","workbook":"xlsx","n_sheets":7,"sheets":["Instructions","Main","GalacticSearch","AutoNav","Hyperdrive","InterstellarAccuracy","POWERPORT"],"not_rendered":{"charts":0,"images":0,"macros":1,"external_links":0,"defined_names":6,"comments":0,"pivot_tables":0},"unopened":[],"bounds":{"document_bytes":16777216,"sheet_cells":100000,"rows_first":2000,"rows_last":500,"rows_between":2000,"halvings":0,"cell_chars":16384,"cell_head_chars":4096},"cells_cut":0,"cells_raw":0,"read":"whole","date_system":"1900"}

{"sheet":"Instructions","index":0,"n_rows":34,"n_cols":1,"rows_kept":34,"cut":false,"hidden":false,"merged":[]}
["Instructions"]
["This document illustrates the Overall Score calculation used in the Infinite Recharge at Home Skills Challenge"]
["The Main sheet shows a display of teams in the hypothetical group, raw scores for each challenge, the calculated score for each challenge, and an overall score/leaderboard"]
["Individual Challenge sheets pull team and score data from the Main sheet and show details about the Calculated Score calculation for that challenge"]
["For an online version of these calculations, visit frcathome.org"]
[]
["The Main sheet also contains a button to generate random data and cells to control how many teams participate in each challenge when the data is randomized"]
["In addition to randomly generated data, users can provide their own data or modify the randomly generated dataset after it is created"]
["The random data is implemented using Macros so you can seamlessly switch between user entered data and randomized data without needing to restore any formulas"]
["If entering user provided challenge data, the Team number and Raw Score columns on the \"Main\" sheet are the only columns that should be modified"]
[]
["Randomizing Data"]
["Randomizing data using the button requires macros to be enabled"]
["Randomizing data overwrites all data in \"Raw Score\" columns, including user entered data. Proceed with caution!!"]
["1. Configure the number of teams in the group by adding or removing team numbers in the team number column of the Main sheet, up to a maximum of 35 teams. "]
{"$rows_left_out":20}
{"sheet":"Main","index":1,"n_rows":45,"n_cols":33,"rows_kept":45,"cut":false,"hidden":false,"merged":[[8,25,8,26],[6,10,7,10],[8,1,8,2],[6,2,7,2],[6,4,7,4],[6,6,7,6],[6,8,7,8],[8,9,8,10],[8,7,8,8],[8,5,8,6],[8,3,8,4]]}
[]
[]
[null,null,null,"Randomizing data overwrites all data in \"Raw Score\" columns, including user entered data. Proceed with caution!!"]
[]
[null,null,null,"A team's top 3 scores (those that contribute to their Overall Score) are indicated using bold text"]
[]
[null,null,"<- Challenge team count",null,"<- Challenge team count",null,"<- Challenge team count",null,"<- Challenge team count",null,"<- Challenge team count"]
[null,10,null,18,null,30,null,27,null,27]
[null,"Galactic Search",null,"AutoNav",null,"Hyperdrive",null,"Interstellar Accuracy",null,"POWERPORT",null,null,null,null,null,null,"Overall Info",null,null,null,null,null,null,null,null,"Leaderboard"]
["Team","Raw Score","Computed Score","Raw Score","Computed Score","Raw Score","Computed Score","Raw Score","Computed Score","Raw Score","Computed Score","C1","C2","C3","C4","C5","Challenges completed","Overall Score","TieBreak1","TieBreak2","TieBreak3","TieBreak4","TieBreak5","Overall score with Tiebreakers",null,"Rank","Team","Overall Score","Score with Tiebreaks","Tiebreaker 1","Tiebreaker 2","Tiebreaker 3","Tiebreaker 4"]
[1,45.799999237060547,{"$f":"VLOOKUP(A11,GalacticSearch!B$14:'GalacticSearch'!E$48,4, FALSE)","v":106.95},126.09999847412109,{"$f":"VLOOKUP(A11,AutoNav!B$14:'AutoNav'!E$48,4, FALSE)","v":66.25},146.10000610351563,{"$f":"VLOOKUP(A11,Hyperdrive!B$14:'Hyperdrive'!E$48,4, FALSE)","v":86.03},34,{"$f":"VLOOKUP(A11,InterstellarAccuracy!B$14:'InterstellarAccuracy'!E$48,4, FALSE)","v":120.27},50,{"$f":"VLOOKUP(A11,POWERPORT!B$14:'POWERPORT'!E$48,4, FALSE)","v":131.63},{"$f":"C11","v":106.95},{"$f":"E11","v":66.25},{"$f":"G11","v":86.03},{"$f":"I11","v":120.27},{"$f":"K11","v":131.63},{"$f":"COUNTIF(L11:P11,\">1\")","v":5},{"$f":"LARGE(L11:P11,1)+LARGE(L11:P11,2)+LARGE(L11:P11,3)","v":358.84999999999997},{"$f":"LARGE(L11:P11,1)","v":131.63},{"$f":"LARGE(L11:P11,2)","v":120.27},{"$f":"LARGE(L11:P11,4)","v":86.03},{"$f":"LARGE(L11:P11,5)","v":66.25},{"$f":"IF(ISBLANK(A11), 0, RANDBETWEEN(1,99))","v":25},{"$f":"R11+RANK(S11,$S$11:$S$45,1)*0.0001+RANK(T11,$T$11:$T$45,1)*0.000001+RANK(U11,$U$11:$U$45,1)*0.00000001+RANK(V11,$V$11:$V$45,1)*0.0000000001+W11*0.000000000001","v":358.85233131332495},null,1,{"$f":"INDEX($A$11:$A$45,MATCH(AC11,$X$11:$X$45,0))","v":7},{"$f":"INDEX($R$11:$R$45,MATCH(AC11,$X$11:$X$45,0))","v":415.63},{"$f":"LARGE($X$11:$X$45,ROW()-ROW($AC$10))","v":415.63303327011096},{"$f":"IFERROR(INDEX(S$11:S$45,MATCH($AA11,$A$11:$A$45,0)),0)","v":147.96},{"$f":"IFERROR(INDEX(T$11:T$45,MATCH($AA11,$A$11:$A$45,0)),0)","v":136.59},{"$f":"IFERROR(INDEX(U$11:U$45,MATCH($AA11,$A$11:$A$45,0)),0)","v":70.069999999999993},{"$f":"IFERROR(INDEX(V$11:V$45,MATCH($AA11,$A$11:$A$45,0)),0)","v":0}]
[2,38.700000762939453,{"$f":"VLOOKUP(A12,GalacticSearch!B$14:'GalacticSearch'!E$48,4, FALSE)","v":117.35},65.5,{"$f":"VLOOKUP(A12,AutoNav!B$14:'AutoNav'!E$48,4, FALSE)","v":120.07},83.699996948242188,{"$f":"VLOOKUP(A12,Hyperdrive!B$14:'Hyperdrive'!E$48,4, FALSE)","v":129.61000000000001},32,{"$f":"VLOOKUP(A12,InterstellarAccuracy!B$14:'InterstellarAccuracy'!E$48,4, FALSE)","v":114.86},18,{"$f":"VLOOKUP(A12,POWERPORT!B$14:'POWERPORT'!E$48,4, FALSE)","v":66.33},117.35,120.07,129.61000000000001,114.86,66.33,5,367.03,{"$f":"LARGE(L12:P12,1)","v":129.61000000000001},{"$f":"LARGE(L12:P12,2)","v":120.07},{"$f":"LARGE(L12:P12,4)","v":114.86},{"$f":"LARGE(L12:P12,5)","v":66.33},{"$f":"IF(ISBLANK(A12), 0, RANDBETWEEN(1,99))","v":58},{"$f":"R12+RANK(S12,$S$11:$S$45,1)*0.0001+RANK(T12,$T$11:$T$45,1)*0.000001+RANK(U12,$U$11:$U$45,1)*0.00000001+RANK(V12,$V$11:$V$45,1)*0.0000000001+W12*0.000000000001","v":367.03213035345789},null,2,{"$f":"INDEX($A$11:$A$45,MATCH(AC12,$X$11:$X$45,0))","v":24},{"$f":"INDEX($R$11:$R$45,MATCH(AC12,$X$11:$X$45,0))","v":402.76},402.76313530013005,{"$f":"IFERROR(INDEX(S$11:S$45,MATCH($AA12,$A$11:$A$45,0)),0)","v":150},{"$f":"IFERROR(INDEX(T$11:T$45,MATCH($AA12,$A$11:$A$45,0)),0)","v":145.91999999999999},{"$f":"IFERROR(INDEX(U$11:U$45,MATCH($AA12,$A$11:$A$45,0)),0)","v":78.069999999999993},{"$f":"IFERROR(INDEX(V$11:V$45,MATCH($AA12,$A$11:$A$45,0)),0)","v":0}]
[3,29,{"$f":"VLOOKUP(A13,GalacticSearch!B$14:'GalacticSearch'!E$48,4, FALSE)","v":131.55000000000001},0,{"$f":"VLOOKUP(A13,AutoNav!B$14:'AutoNav'!E$48,4, FALSE)","v":0},197.69999694824219,{"$f":"VLOOKUP(A13,Hyperdrive!B$14:'Hyperdrive'!E$48,4, FALSE)","v":50},32,{"$f":"VLOOKUP(A13,InterstellarAccuracy!B$14:'InterstellarAccuracy'!E$48,4, FALSE)","v":114.86},13,{"$f":"VLOOKUP(A13,POWERPORT!B$14:'POWERPORT'!E$48,4, FALSE)","v":56.12},131.55000000000001,0,50,114.86,56.12,4,302.53000000000003,131.55000000000001,114.86,50,0,20,302.53222718012,null,3,5,376.87,376.87293234353001,145.19999999999999,126.33,98.65,90.82]
[4,0,{"$f":"VLOOKUP(A14,GalacticSearch!B$14:'GalacticSearch'!E$48,4, FALSE)","v":0},0,{"$f":"VLOOKUP(A14,AutoNav!B$14:'AutoNav'!E$48,4, FALSE)","v":0},54.5,{"$f":"VLOOKUP(A14,Hyperdrive!B$14:'Hyperdrive'!E$48,4, FALSE)","v":150},19,{"$f":"VLOOKUP(A14,InterstellarAccuracy!B$14:'InterstellarAccuracy'!E$48,4, FALSE)","v":79.73},56,{"$f":"VLOOKUP(A14,POWERPORT!B$14:'POWERPORT'!E$48,4, FALSE)","v":143.88},0,0,150,79.73,143.88,3,373.61,150,143.88,0,0,84,373.61313401018407,null,4,4,373.61,373.61313401018407,150,143.88,0,0]
[5,46.900001525878906,{"$f":"VLOOKUP(A15,GalacticSearch!B$14:'GalacticSearch'!E$48,4, FALSE)","v":105.34},37.200000762939453,{"$f":"VLOOKUP(A15,AutoNav!B$14:'AutoNav'!E$48,4, FALSE)","v":145.19999999999999},88.400001525878906,{"$f":"VLOOKUP(A15,Hyperdrive!B$14:'Hyperdrive'!E$48,4, FALSE)","v":126.33},26,{"$f":"VLOOKUP(A15,InterstellarAccuracy!B$14:'InterstellarAccuracy'!E$48,4, FALSE)","v":98.65},30,{"$f":"VLOOKUP(A15,POWERPORT!B$14:'POWERPORT'!E$48,4, FALSE)","v":90.82},105.34,145.19999999999999,126.33,98.65,90.82,5,376.87,145.19999999999999,126.33,98.65,90.82,30,376.87293234353001,null,5,2,367.03,367.03213035345789,129.61000000000001,120.07,114.86,66.33]
{"$rows_left_out":31}
{"sheet":"GalacticSearch","index":2,"n_rows":48,"n_cols":8,"rows_kept":48,"cut":false,"hidden":false,"merged":[[1,1,2,2],[7,5,7,6],[1,5,1,6]]}
[]
[null,"Reference Information (N is driven by value on Main Sheet)",null,null,null,"Outlier Rejection"]
[null,null,null,null,null,"Q1",{"$f":"IF(C4*0.25=INT(C4*0.25),(OFFSET(G13,C4*0.25,0)+OFFSET(G13,C4*0.25+1,0))/2,OFFSET(G13,_xlfn.CEILING.MATH(C4*0.25),0))","v":38.700000762939453}]
[null,"N:",{"$f":"COUNTIF(C14:C48, \"<>0\")","v":10},null,null,"Q3",{"$f":"IF(C4*0.75=INT(C4*0.75),(OFFSET(G13,C4*0.75,0)+OFFSET(G13,C4*0.75+1,0))/2,OFFSET(G13,_xlfn.CEILING.MATH(C4*0.75),0))","v":61.700000762939453}]
[null,"Score type:","1 decimal",null,null,"RLower",{"$f":"G3-1*(G4-G3)","v":15.700000762939453},"=Q1-1*(Q3-Q1)"]
[null,"Max or min to win?","Min",null,null,"RUpper",{"$f":"G4+1*(G4-G3)","v":84.700000762939453},"=Q3+1*(Q3-Q1)"]
[]
[null,"Minimum and Maximum score",null,null,null,"Bounded Score Information"]
[null,"Max score (CMax)",150,null,null,"BLast",{"$f":"MAX(OFFSET($D$14,0,0,35))","v":84.700000762939453}]
[null,"Min score (CMin)",{"$f":"MAX(C9-20*(C4-1),50)","v":50},"=Max(Cmax-20*(N-1), 50)",null,"BFirst",{"$f":"MIN(IF(OFFSET($D$14,0,0,35)=0,\"\",OFFSET($D$14,0,0,35)))","v":16.399999618530273}]
[null,null,null,null,"To re-sort after data has been updated, click the arrow next to"]
[null,"Computed Score = ABS((B-Blast)/(Bfirst-Blast)) * (Cmax - Cmin) + Cmin",null,null,"Computed Score and select \"Largest to Smallest\""]
[null,"Team #","Raw Score (R)","Bounded Score (B)","Computed Score (C)",null,"Sorted Raw Scores (for Quartile calcs)"]
[null,{"$f":"Main!A11","v":1},{"$f":"Main!B11","v":45.799999237060547},{"$f":"IF(C14<>0,IF(C14<$G$5,$G$5,IF(C14>$G$6,$G$6,C14)),0)","v":45.799999237060547},{"$f":"IF(D14>0,IF(($G$9-$G$10)<>0,ROUND((D14-$G$9)/($G$10-$G$9)*($C$9-$C$10)+$C$10,2),150),0)","v":106.95},null,{"$f":"IFERROR(SMALL(IF(OFFSET($C$14,0,0,35)=0, \"\", OFFSET($C$14,0,0,35)),ROW()-ROW($G$13)),\"\")","v":16.399999618530273}]
[null,{"$f":"Main!A41","v":0},{"$f":"Main!B41","v":0},0,0,null,{"$f":"IFERROR(SMALL(IF(OFFSET($C$14,0,0,35)=0, \"\", OFFSET($C$14,0,0,35)),ROW()-ROW($G$13)),\"\")","v":29}]
{"$rows_left_out":34}
{"sheet":"AutoNav","index":3,"n_rows":48,"n_cols":8,"rows_kept":48,"cut":false,"hidden":false,"merged":[[1,1,2,2],[1,5,1,6],[7,5,7,6]]}
[]
[null,"Reference Information (N is driven by value on Main Sheet)",null,null,null,"Outlier Rejection"]
[null,null,null,null,null,"Q1",{"$f":"IF(C4*0.25=INT(C4*0.25),(OFFSET(G13,C4*0.25,0)+OFFSET(G13,C4*0.25+1,0))/2,OFFSET(G13,_xlfn.CEILING.MATH(C4*0.25),0))","v":71.800003051757813}]
[null,"N:",{"$f":"COUNTIF(C14:C48, \"<>0\")","v":18},null,null,"Q3",{"$f":"IF(C4*0.75=INT(C4*0.75),(OFFSET(G13,C4*0.75,0)+OFFSET(G13,C4*0.75+1,0))/2,OFFSET(G13,_xlfn.CEILING.MATH(C4*0.75),0))","v":125.80000305175781}]
[null,"Score type:","1 decimal",null,null,"RLower",{"$f":"G3-1*(G4-G3)","v":17.800003051757813},"=Q1-1*(Q3-Q1)"]
[null,"Max or min to win?","Min",null,null,"RUpper",{"$f":"G4+1*(G4-G3)","v":179.80000305175781},"=Q3+1*(Q3-Q1)"]
[]
[null,"Minimum and Maximum score",null,null,null,"Bounded Score Information"]
[null,"Max score (CMax)",150,null,null,"BLast",{"$f":"MAX(OFFSET($D$14,0,0,35))","v":144.39999389648438}]
[null,"Min score (CMin)",{"$f":"MAX(C9-20*(C4-1),50)","v":50},"=Max(Cmax-20*(N-1), 50)",null,"BFirst",{"$f":"MIN(IF(OFFSET($D$14,0,0,35)=0,\"\",OFFSET($D$14,0,0,35)))","v":31.799999237060547}]
[null,null,null,null,"To re-sort after data has been updated, click the arrow next to"]
[null,"Computed Score = ABS((B-Blast)/(Bfirst-Blast)) * (Cmax - Cmin) + Cmin",null,null,"Computed Score and select \"Largest to Smallest\""]
[null,"Team #","Raw Score (R)","Bounded Score (B)","Computed Score (C)",null,"Sorted Raw Scores (for Quartile calcs)"]
[null,{"$f":"Main!A11","v":1},{"$f":"Main!D11","v":126.09999847412109},{"$f":"IF(C14<>0,IF(C14<$G$5,$G$5,IF(C14>$G$6,$G$6,C14)),0)","v":126.09999847412109},{"$f":"IF(D14>0,IF(($G$10-$G$9)<>0,ROUND((D14-$G$9)/($G$10-$G$9)*($C$9-$C$10)+$C$10,2),150),0)","v":66.25},null,{"$f":"IFERROR(SMALL(IF(OFFSET($C$14,0,0,35)=0, \"\", OFFSET($C$14,0,0,35)),ROW()-ROW($G$13)),\"\")","v":31.799999237060547}]
[null,{"$f":"Main!A34","v":24},{"$f":"Main!D34","v":80.400001525878906},80.400001525878906,106.84,null,{"$f":"IFERROR(SMALL(IF(OFFSET($C$14,0,0,35)=0, \"\", OFFSET($C$14,0,0,35)),ROW()-ROW($G$13)),\"\")","v":37.200000762939453}]
{"$rows_left_out":34}
{"sheet":"Hyperdrive","index":4,"n_rows":48,"n_cols":8,"rows_kept":48,"cut":false,"hidden":false,"merged":[[1,1,2,2],[1,5,1,6],[7,5,7,6]]}
[]
[null,"Reference Information (N is driven by value on Main Sheet)",null,null,null,"Outlier Rejection"]
[null,null,null,null,null,"Q1",{"$f":"IF(C4*0.25=INT(C4*0.25),(OFFSET(G13,C4*0.25,0)+OFFSET(G13,C4*0.25+1,0))/2,OFFSET(G13,_xlfn.CEILING.MATH(C4*0.25),0))","v":85.199996948242188}]
[null,"N:",{"$f":"COUNTIF(C14:C48, \"<>0\")","v":30},null,null,"Q3",{"$f":"IF(C4*0.75=INT(C4*0.75),(OFFSET(G13,C4*0.75,0)+OFFSET(G13,C4*0.75+1,0))/2,OFFSET(G13,_xlfn.CEILING.MATH(C4*0.75),0))","v":161.60000610351563}]
[null,"Score type:","1 decimal",null,null,"RLower",{"$f":"G3-1*(G4-G3)","v":8.79998779296875},"=Q1-1*(Q3-Q1)"]
[null,"Max or min to win?","Min",null,null,"RUpper",{"$f":"G4+1*(G4-G3)","v":238.00001525878906},"=Q3+1*(Q3-Q1)"]
[]
[null,"Minimum and Maximum score",null,null,null,"Bounded Score Information"]
[null,"Max score (CMax)",150,null,null,"BLast",{"$f":"MAX(OFFSET($D$14,0,0,35))","v":197.69999694824219}]
[null,"Min score (CMin)",{"$f":"MAX(C9-20*(C4-1),50)","v":50},"=Max(Cmax-20*(N-1), 50)",null,"BFirst",{"$f":"MIN(IF(OFFSET($D$14,0,0,35)=0,\"\",OFFSET($D$14,0,0,35)))","v":54.5}]
[null,null,null,null,"To re-sort after data has been updated, click the arrow next to"]
[null,"Computed Score = ABS((B-Blast)/(Bfirst-Blast)) * (Cmax - Cmin) + Cmin",null,null,"Computed Score and select \"Largest to Smallest\""]
[null,"Team #","Raw Score (R)","Bounded Score (B)","Computed Score (C)",null,"Sorted Raw Scores (for Quartile calcs)"]
[null,{"$f":"Main!A15","v":5},{"$f":"Main!F15","v":88.400001525878906},{"$f":"IF(C14<>0,IF(C14<$G$5,$G$5,IF(C14>$G$6,$G$6,C14)),0)","v":88.400001525878906},{"$f":"IF(D14>0,IF(($G$10-$G$9)<>0,ROUND((D14-$G$9)/($G$10-$G$9)*($C$9-$C$10)+$C$10,2),150),0)","v":126.33},null,{"$f":"IFERROR(SMALL(IF(OFFSET($C$14,0,0,35)=0, \"\", OFFSET($C$14,0,0,35)),ROW()-ROW($G$13)),\"\")","v":54.5}]
[null,{"$f":"Main!A43","v":0},{"$f":"Main!F43","v":0},0,0,null,{"$f":"IFERROR(SMALL(IF(OFFSET($C$14,0,0,35)=0, \"\", OFFSET($C$14,0,0,35)),ROW()-ROW($G$13)),\"\")","v":63.299999237060547}]
{"$rows_left_out":34}
{"sheet":"InterstellarAccuracy","index":5,"n_rows":48,"n_cols":8,"rows_kept":48,"cut":false,"hidden":false,"merged":[[1,1,2,2],[1,5,1,6],[7,5,7,6]]}
[]
[null,"Reference Information (N is driven by value on Main Sheet)",null,null,null,"Outlier Rejection"]
[null,null,null,null,null,"Q1",{"$f":"IF(C4*0.25=INT(C4*0.25),(OFFSET(G13,C4*0.25,0)+OFFSET(G13,C4*0.25+1,0))/2,OFFSET(G13,_xlfn.CEILING.MATH(C4*0.25),0))","v":13}]
[null,"N:",{"$f":"COUNTIF(C14:C48, \"<>0\")","v":27},null,null,"Q3",{"$f":"IF(C4*0.75=INT(C4*0.75),(OFFSET(G13,C4*0.75,0)+OFFSET(G13,C4*0.75+1,0))/2,OFFSET(G13,_xlfn.CEILING.MATH(C4*0.75),0))","v":32}]
[null,"Score type:","1 decimal",null,null,"RLower",{"$f":"G3-1*(G4-G3)","v":-6},"=Q1-1*(Q3-Q1)"]
[null,"Max or min to win?","Max",null,null,"RUpper",{"$f":"G4+1*(G4-G3)","v":51},"=Q3+1*(Q3-Q1)"]
[]
[null,"Minimum and Maximum score",null,null,null,"Bounded Score Information"]
[null,"Max score (CMax)",150,null,null,"BLast",{"$f":"MIN(IF(OFFSET($D$14,0,0,35)=0,\"\",OFFSET($D$14,0,0,35)))","v":8}]
[null,"Min score (CMin)",{"$f":"MAX(C9-20*(C4-1),50)","v":50},"=Max(Cmax-20*(N-1), 50)",null,"BFirst",{"$f":"MAX(OFFSET($D$14,0,0,35))","v":45}]
[null,null,null,null,"To re-sort after data has been updated, click the arrow next to"]
[null,"Computed Score = ABS((B-Blast)/(Bfirst-Blast)) * (Cmax - Cmin) + Cmin",null,null,"Computed Score and select \"Largest to Smallest\""]
[null,"Team #","Raw Score (R)","Bounded Score (B)","Computed Score (C)",null,"Sorted Raw Scores (for Quartile calcs)"]
[null,{"$f":"Main!A35","v":25},{"$f":"Main!H35","v":27},{"$f":"IF(C14<>0,IF(C14<$G$5,$G$5,IF(C14>$G$6,$G$6,C14)),0)","v":27},{"$f":"IF(D14>0,IF(($G$10-$G$9)<>0,ROUND((D14-$G$9)/($G$10-$G$9)*($C$9-$C$10)+$C$10,2),150),0)","v":101.35},null,{"$f":"IFERROR(SMALL(IF(OFFSET($C$14,0,0,35)=0, \"\", OFFSET($C$14,0,0,35)),ROW()-ROW($G$13)),\"\")","v":8}]
[null,{"$f":"Main!A16","v":6},{"$f":"Main!H16","v":41},41,139.19,null,{"$f":"IFERROR(SMALL(IF(OFFSET($C$14,0,0,35)=0, \"\", OFFSET($C$14,0,0,35)),ROW()-ROW($G$13)),\"\")","v":9}]
{"$rows_left_out":34}
{"sheet":"POWERPORT","index":6,"n_rows":48,"n_cols":8,"rows_kept":48,"cut":false,"hidden":false,"merged":[[1,1,2,2],[1,5,1,6],[7,5,7,6]]}
[]
[null,"Reference Information (N is driven by value on Main Sheet)",null,null,null,"Outlier Rejection"]
[null,null,null,null,null,"Q1",{"$f":"IF(C4*0.25=INT(C4*0.25),(OFFSET(G13,C4*0.25,0)+OFFSET(G13,C4*0.25+1,0))/2,OFFSET(G13,_xlfn.CEILING.MATH(C4*0.25),0))","v":18}]
[null,"N:",{"$f":"COUNTIF(C14:C48, \"<>0\")","v":27},null,null,"Q3",{"$f":"IF(C4*0.75=INT(C4*0.75),(OFFSET(G13,C4*0.75,0)+OFFSET(G13,C4*0.75+1,0))/2,OFFSET(G13,_xlfn.CEILING.MATH(C4*0.75),0))","v":47}]
[null,"Score type:","1 decimal",null,null,"RLower",{"$f":"G3-1*(G4-G3)","v":-11},"=Q1-1*(Q3-Q1)"]
[null,"Max or min to win?","Max",null,null,"RUpper",{"$f":"G4+1*(G4-G3)","v":76},"=Q3+1*(Q3-Q1)"]
[]
[null,"Minimum and Maximum score",null,null,null,"Bounded Score Information"]
[null,"Max score (CMax)",150,null,null,"BLast",{"$f":"MIN(IF(OFFSET($D$14,0,0,35)=0,\"\",OFFSET($D$14,0,0,35)))","v":10}]
[null,"Min score (CMin)",{"$f":"MAX(C9-20*(C4-1),50)","v":50},"=Max(Cmax-20*(N-1), 50)",null,"BFirst",{"$f":"MAX(OFFSET($D$14,0,0,35))","v":59}]
[null,null,null,null,"To re-sort after data has been updated, click the arrow next to"]
[null,"Computed Score = ABS((B-Blast)/(Bfirst-Blast)) * (Cmax - Cmin) + Cmin",null,null,"Computed Score and select \"Largest to Smallest\""]
[null,"Team #","Raw Score (R)","Bounded Score (B)","Computed Score (C)",null,"Sorted Raw Scores (for Quartile calcs)"]
[null,{"$f":"Main!A20","v":10},{"$f":"Main!J20","v":10},{"$f":"IF(C14<>0,IF(C14<$G$5,$G$5,IF(C14>$G$6,$G$6,C14)),0)","v":10},{"$f":"IF(D14>0,IF(($G$10-$G$9)<>0,ROUND((D14-$G$9)/($G$10-$G$9)*($C$9-$C$10)+$C$10,2),150),0)","v":50},null,{"$f":"IFERROR(SMALL(IF(OFFSET($C$14,0,0,35)=0, \"\", OFFSET($C$14,0,0,35)),ROW()-ROW($G$13)),\"\")","v":10}]
[null,{"$f":"Main!A27","v":17},{"$f":"Main!J27","v":37},37,105.1,null,{"$f":"IFERROR(SMALL(IF(OFFSET($C$14,0,0,35)=0, \"\", OFFSET($C$14,0,0,35)),ROW()-ROW($G$13)),\"\")","v":13}]
{"$rows_left_out":33}